{"text_format":"1","workbook":"xlsx","n_sheets":6,"sheets":["Palkkalaskuri","Taul1","Amm. vuosityöaika","Kansanopistot (vuosityöaika)","Urheiluopistot","AmmVTALask"],"not_rendered":{"charts":0,"images":0,"macros":1,"external_links":0,"defined_names":5,"comments":2,"pivot_tables":0},"unopened":[],"bounds":{"document_bytes":16777216,"sheet_cells":100000,"rows_first":2000,"rows_last":500,"rows_between":2000,"halvings":0,"cell_chars":16384,"cell_head_chars":4096},"cells_cut":0,"cells_raw":0,"read":"whole","date_system":"1900"}

{"sheet":"Palkkalaskuri","index":0,"n_rows":57,"n_cols":8,"rows_kept":57,"cut":false,"hidden":false,"merged":[[16,1,16,10]]}
[null,"Sivistystyönantajat ry:n yksityisen opetusalan palkkalaskuri"]
[null,"Peruskoulu ja lukio 1.7.2025, muut 1.8.2025 lukien"]
[null,"Valitse  alla olevasta listasta palkkakoodi, anna kalleusluokka ja kokemuslisiin oikeuttava aika"]
[null,"sekä täytä keltaisella pohjalla kysytyt tiedot."]
[]
[]
[]
[]
[]
[]
[]
[]
[]
[]
[]
[null,"Valittuna:"]
[null,{"$f":"VLOOKUP(Taul1!E1,Taul1!A9:Y69,25,FALSE)","v":"011064  Peruskoulun rehtori"}]
[null,"Hinnoittelukohdan alaraja:",null,null,null,{"$f":"Taul1!E3","v":4484.53}]
[null,null,"Kokemuslisien prosentit:"]
[null,null,"3 v","5 v"," 8 v","13 v","15 v","20 v"]
[null,null,{"$f":"Taul1!K4","v":0},{"$f":"Taul1!L4","v":0.05},{"$f":"Taul1!M4","v":0.05},{"$f":"Taul1!N4","v":0.09},{"$f":"Taul1!O4","v":0},{"$f":"Taul1!P4","v":0.06}]
[null,null,"15 vuoden kokemuslisä käytössä vain eräissä ammatillisissa oppilaitoksissa."]
[null,null,"Steinerkouluissa kokemuslisävuodet ovat 5, 7, 10, 15 ja 20"]
[]
[null,null,null,null,null,"I kalleusluokan kunnat:"]
[null,null,null,null,null,"Enontekiö, Espoo, Helsinki, Hyrynsalmi, "]
[null,null,null,null,null,"Hyvinkää, Hämeenlinna, Ii, Inari, Joensuu, "]
[null,null,null,null,null,"Jyväskylä, Järvenpää, Kauniainen, Kemi, "]
[null,null,null,null,null,"Kemijärvi, Keminmaa, Kerava, Kirkkonummi,"]
[null,null,null,null,null,"Kittilä, Kolari, Kuhmo, Kuopio, Kuusamo,"]
{"$rows_left_out":28}
{"sheet":"Taul1","index":1,"n_rows":69,"n_cols":38,"rows_kept":69,"cut":false,"hidden":true,"merged":[[1,10,1,11]]}
[null,null,null,"Rivinumero",1,null,null,null,null,null,null,null,null,null,null,null,null,null,null,null,null,null,null,{"$f":"VLOOKUP(E1,$A$9:$X$69,22,FALSE)","v":1.2017250000000002}]
[null,null,null,"Kalleusluokka",1,{"$f":"VLOOKUP(E1,$A$9:$I$69,7+E2,FALSE)","v":1},{"$f":"VLOOKUP(E1,$A$9:$J$69,10,FALSE)","v":0},null,null,null,{"$f":"1/F2","v":1},null,null,null,null,null,null,null,null,null,null,null,null,{"$f":"IF(Taul1!X1=1,\"Valittu hinnoittelukohta ei ole\",\"\")","v":""}]
[null,null,null,"Alaraja",{"$f":"VLOOKUP(E1,A9:F69,4+E2)","v":4484.53},null,null,null,null,null,null,null,null,null,null,null,null,null,null,null,null,null,null,{"$f":"IF(Taul1!X1=1,\"ylituntipalkkiojärjestelmässä \",\"\")","v":""}]
[null,null,null,"Vuosid.lisä",7,null,null,null,null,null,{"$f":"VLOOKUP($E$1,$A$9:$P$69,11)/100","v":0},{"$f":"VLOOKUP($E$1,$A$9:$P$69,12)/100","v":0.05},{"$f":"VLOOKUP($E$1,$A$9:$P$69,13)/100","v":0.05},{"$f":"VLOOKUP($E$1,$A$9:$P$69,14)/100","v":0.09},{"$f":"VLOOKUP($E$1,$A$9:$P$69,15)/100","v":0},{"$f":"VLOOKUP($E$1,$A$9:$P$69,16)/100","v":0.06},null,null,null,null,null,null,"Kertatuntipalkkio:",{"$f":"ROUND(ROUND(Palkkalaskuri!H48*Taul1!$F$2/(Palkkalaskuri!$H$44-G2),2)*12/G6,2)","v":{"$error":"#DIV/0!"}},{"$f":"IF(Taul1!X1=1,\"--\",Taul1!X4)","v":{"$error":"#DIV/0!"}}]
[null,null,null,"Vuosisid.lisän kerroin",{"$f":"VLOOKUP(E1,A9:W69,16+E4,FALSE)","v":1.2738285000000003}]
[null,null,null,"Vuosisi. lisä e",{"$f":"ROUND(E5*E3-E3,2)","v":1227.99},null,{"$f":"VLOOKUP($E$1,$A$9:$J$69,7)","v":38},null,null,{"$f":"VLOOKUP($E$1,$A$9:$J$69,8)","v":1}]
[null,null,null,null,null,null,null,"Ylituntikerroin"]
["Index","Liite","Hitu","Nimi","I kl","II kl","Viikot","I","II","Kerroin","3 v","5 v","8 v","13 v","15 v","20 v","0 v.","3v","5v","8v","13v","15v","20v","Kok.työaika","Listanimi",null,null,null,null,null,null,null,null,null,null,null,null,"Tark I/II"]
[1,null,"011064","Peruskoulun rehtori",4484.53,4361.04,38,1,1,0,null,5,5,9,null,6,1,{"$f":"K9/100+1","v":1},{"$f":"R9*(L9/100+1)","v":1.05},{"$f":"S9*(M9/100+1)","v":1.1025},{"$f":"T9*(N9/100+1)","v":1.2017250000000002},{"$f":"U9*(O9/100+1)","v":1.2017250000000002},{"$f":"V9*(P9/100+1)","v":1.2738285000000003},1,{"$f":"C9&\"  \"&D9","v":"011064  Peruskoulun rehtori"},null,null,null,null,null,null,null,null,null,null,null,null,{"$f":"F9/E9","v":0.9724631120764049}]
[2,null,"011065","Lukion rehtori",4674.57,4545.8599999999997,38,1,1,0,null,5,5,9,null,6,1,{"$f":"K10/100+1","v":1},1.05,1.1025,1.2017250000000002,1.2017250000000002,1.2738285000000003,1,{"$f":"C10&\"  \"&D10","v":"011065  Lukion rehtori"},null,null,null,null,null,null,null,null,null,null,null,null,{"$f":"F10/E10","v":0.97246591665115723}]
[3,null,"011261","Johtaja (8 §)",3907.49,3800.05,38,1,1,0,null,5,5,5,null,6,1,1,1.05,1.1025,1.1576250000000001,1.1576250000000001,1.2270825000000003,1,"011261  Johtaja (8 §)",null,null,null,null,null,null,null,null,null,null,null,null,0.97250408830220947]
[4,null,"011259","Johtaja (10 §)",3650.9,3550.78,38,1,1,0,null,5,5,5,null,6,1,1,1.05,1.1025,1.1576250000000001,1.1576250000000001,1.2270825000000003,1,"011259  Johtaja (10 §)",null,null,null,null,null,null,null,null,null,null,null,null,0.9725766249417952]
[5,null,"011154","Apulaisjohtaja (10 §)",3001.66,2919.23,38,1,1,0,null,5,5,5,null,6,1,1,1.05,1.1025,1.1576250000000001,1.1576250000000001,1.2270825000000003,1,"011154  Apulaisjohtaja (10 §)",null,null,null,null,null,null,null,null,null,null,null,null,0.97253852868079671]
[6,null,"012151","1. Lehtori ja opinto-ohjaaja(lukio) a. Ylempi korkeakoulututkinto ja lukio-opetusta antavan opettajan kelpoisuus taikka aiempi vanhemman lehtorin kelpoisuus",3560.14,3461.98,38,0.83599999999999997,0.86,0,null,6,7,8,null,6,1,1,1.06,1.1342000000000001,1.2249360000000002,1.2249360000000002,1.2984321600000004,0,"012151  1. Lehtori ja opinto-ohjaaja(lukio) a. Ylempi korkeakoulututkinto ja lukio-opetusta antavan opettajan kelpoisuus taikka aiempi vanhemman lehtorin kelpoisuus",null,null,null,null,null,null,null,null,null,null,null,null,0.97242805058228055]
[7,null,"012150","1. Lehtori ja opinto-ohjaaja(lukio) b. Perusopetusta antavan opettajan tai aiempi lukio-opetusta antavan opettajan kelp.",3422.93,3329.06,38,0.84699999999999998,0.871,0,null,6,7,8,null,6,1,1,1.06,1.1342000000000001,1.2249360000000002,1.2249360000000002,1.2984321600000004,0,"012150  1. Lehtori ja opinto-ohjaaja(lukio) b. Perusopetusta antavan opettajan tai aiempi lukio-opetusta antavan opettajan kelp.",null,null,null,null,null,null,null,null,null,null,null,null,0.97257612630115142]
[8,null,"012145","1. Lehtori ja opinto-ohjaaja(lukio) c. Ylempi tai alempi korkeakoulututkinto",2932.23,2861.83,38,0.88,0.90200000000000002,0,null,6,7,8,null,6,1,1,1.06,1.1342000000000001,1.2249360000000002,1.2249360000000002,1.2984321600000004,0,"012145  1. Lehtori ja opinto-ohjaaja(lukio) c. Ylempi tai alempi korkeakoulututkinto",null,null,null,null,null,null,null,null,null,null,null,null,0.97599096933050955]
[9,null,"012139","1. Lehtori ja opinto-ohjaaja(lukio) d. Muu kuin edellä mainittu",2491.21,2434.92,38,0.92500000000000004,0.94799999999999995,0,null,6,7,8,null,6,1,1,1.06,1.1342000000000001,1.2249360000000002,1.2249360000000002,1.2984321600000004,0,"012139  1. Lehtori ja opinto-ohjaaja(lukio) d. Muu kuin edellä mainittu",null,null,null,null,null,null,null,null,null,null,null,null,0.97740455441331719]
[10,null,"012249","2. Lehtori (peruskoulu) a. Ylempi korkeakoulututkinto ja perus-/lukio-opetusta antavan opettajan kelpoisuus tai aiempi vanhemman lehtorin kelpoisuus",3316.5,3227.6,38,0.85399999999999998,0.877,0,null,6,7,8,null,6,1,1,1.06,1.1342000000000001,1.2249360000000002,1.2249360000000002,1.2984321600000004,0,"012249  2. Lehtori (peruskoulu) a. Ylempi korkeakoulututkinto ja perus-/lukio-opetusta antavan opettajan kelpoisuus tai aiempi vanhemman lehtorin kelpoisuus",null,null,null,null,null,null,null,null,null,null,null,{"$f":"E18*W18","v":4306.2502586400014},0.9731946328961254]
[11,null,"012248","2. Lehtori (peruskoulu) b. Perusopetusta antavan opettajan tai aiempi peruskoulun/lukion opettajan kelpoisuus",3176.22,3093.9,38,0.86799999999999999,0.89100000000000001,0,null,6,7,8,null,6,1,1,1.06,1.1342000000000001,1.2249360000000002,1.2249360000000002,1.2984321600000004,0,"012248  2. Lehtori (peruskoulu) b. Perusopetusta antavan opettajan tai aiempi peruskoulun/lukion opettajan kelpoisuus",null,null,null,null,null,null,null,null,null,null,null,null,0.97408239983376477]
[12,null,"012244","2. Lehtori (peruskoulu) c. Ylempi korkeakoulututkinto",2781.83,2715.85,38,0.90900000000000003,0.93,0,null,6,7,8,null,6,1,1,1.06,1.1342000000000001,1.2249360000000002,1.2249360000000002,1.2984321600000004,0,"012244  2. Lehtori (peruskoulu) c. Ylempi korkeakoulututkinto",null,null,null,null,null,null,null,null,null,null,null,null,0.97628180010999954]
[13,null,"012242","2. Lehtori (peruskoulu) d. Alempi korkeakoulututkinto",2652.85,2590.0500000000002,38,0.91600000000000004,0.93799999999999994,0,null,6,7,8,null,6,1,1,1.06,1.1342000000000001,1.2249360000000002,1.2249360000000002,1.2984321600000004,0,"012242  2. Lehtori (peruskoulu) d. Alempi korkeakoulututkinto",null,null,null,null,null,null,null,null,null,null,null,null,0.97632734606178273]
[14,null,"012239","2. Lehtori (peruskoulu) e. Muu kuin edellä mainittu",2491.21,2434.92,38,0.92500000000000004,0.94799999999999995,0,null,6,7,8,null,6,1,1,1.06,1.1342000000000001,1.2249360000000002,1.2249360000000002,1.2984321600000004,0,"012239  2. Lehtori (peruskoulu) e. Muu kuin edellä mainittu",null,null,null,null,null,null,null,null,null,null,null,null,0.97740455441331719]
[15,null,"012349/ 012649","3. Erityisopettaja ja erityisluokanopettaja a. Ylempi korkeakoulututkinto ja erityisopetusta antavan opettajan kelpoisuus",3316.5,3227.6,38,0.85399999999999998,0.877,0,null,6,7,8,null,6,1,1,1.06,1.1342000000000001,1.2249360000000002,1.2249360000000002,1.2984321600000004,0,"012349/ 012649  3. Erityisopettaja ja erityisluokanopettaja a. Ylempi korkeakoulututkinto ja erityisopetusta antavan opettajan kelpoisuus",null,null,null,null,null,null,null,null,null,null,null,null,0.9731946328961254]
[16,null,"012348/ 012648","3. Erityisopettaja ja erityisluokanopettaja b. Alempi korkeakoulututkinto ja erityisopetusta antavan opettajan kelpoisuus",3176.22,3093.9,38,0.86799999999999999,0.89100000000000001,0,null,6,7,8,null,6,1,1,1.06,1.1342000000000001,1.2249360000000002,1.2249360000000002,1.2984321600000004,0,"012348/ 012648  3. Erityisopettaja ja erityisluokanopettaja b. Alempi korkeakoulututkinto ja erityisopetusta antavan opettajan kelpoisuus",null,null,null,null,null,null,null,null,null,null,null,null,0.97408239983376477]
[17,null,"012347/ 012647","3. Erityisopettaja ja erityisluokanopettaja c. Erityisopetusta antavan opettajan kelpoisuus taikka ylempi korkeakoulututkinto ja perus-/lukio-opetusta antavan opettajan kelpoisuus",3103.82,3026.02,38,0.86799999999999999,0.89,0,null,6,7,8,null,6,1,1,1.06,1.1342000000000001,1.2249360000000002,1.2249360000000002,1.2984321600000004,0,"012347/ 012647  3. Erityisopettaja ja erityisluokanopettaja c. Erityisopetusta antavan opettajan kelpoisuus taikka ylempi korkeakoulututkinto ja perus-/lukio-opetusta antavan opettajan kelpoisuus",null,null,null,null,null,null,null,null,null,null,null,null,0.97493411344730041]
[18,null,"012346/ 012646","3. Erityisopettaja ja erityisluokanopettaja d. Perus-/lukio-opetusta antavan opettajan kelpoisuus",2998.43,2924.61,38,0.879,0.90200000000000002,0,null,6,7,8,null,6,1,1,1.06,1.1342000000000001,1.2249360000000002,1.2249360000000002,1.2984321600000004,0,"012346/ 012646  3. Erityisopettaja ja erityisluokanopettaja d. Perus-/lukio-opetusta antavan opettajan kelpoisuus",null,null,null,null,null,null,null,null,null,null,null,null,0.97538044910169663]
[19,null,"012344/ 012644","3. Erityisopettaja ja erityisluokanopettaja e. Vaikeimmin kehitysvammaisten opettaja, jolla on soveltuva vähintään opistoasteinen tutkinto ja lisäksi 35 opintoviikon erityisopinnot",2781.83,2715.85,38,0.91700000000000004,0.93899999999999995,0,null,6,7,8,null,6,1,{"$f":"K27/100+1","v":1},{"$f":"R27*(L27/100+1)","v":1.06},{"$f":"S27*(M27/100+1)","v":1.1342000000000001},{"$f":"T27*(N27/100+1)","v":1.2249360000000002},{"$f":"U27*(O27/100+1)","v":1.2249360000000002},{"$f":"V27*(P27/100+1)","v":1.2984321600000004},0,"012344/ 012644  3. Erityisopettaja ja erityisluokanopettaja e. Vaikeimmin kehitysvammaisten opettaja, jolla on soveltuva vähintään opistoasteinen tutkinto ja lisäksi 35 opintoviikon erityisopinnot",null,null,null,null,null,null,null,null,null,null,null,null,0.97628180010999954]
[20,null,"012341/ 012641","3. Erityisopettaja ja erityisluokanopettaja f. Muu kuin edellä mainittu tai vaikeimmin kehitysvammaisten opettaja, jolla on soveltuva vähintään opistoasteinen tutkinto",2602.11,2540.86,38,0.90900000000000003,0.93,0,null,6,7,8,null,6,1,1,1.06,1.1342000000000001,1.2249360000000002,1.2249360000000002,1.2984321600000004,0,"012341/ 012641  3. Erityisopettaja ja erityisluokanopettaja f. Muu kuin edellä mainittu tai vaikeimmin kehitysvammaisten opettaja, jolla on soveltuva vähintään opistoasteinen tutkinto",null,null,null,null,null,null,null,null,null,null,null,null,0.97646141016329058]
[21,null,"012449","4. Luokanopettaja a. Ylempi korkeakoulututkinto, aineen opettajan kelpoisuus sekä perus-/lukio-opetusta antavan opettajan kelpoisuus",3316.5,3227.6,38,0.84299999999999997,0.86599999999999999,0,null,6,7,8,null,6,1,1,1.06,1.1342000000000001,1.2249360000000002,1.2249360000000002,1.2984321600000004,0,"012449  4. Luokanopettaja a. Ylempi korkeakoulututkinto, aineen opettajan kelpoisuus sekä perus-/lukio-opetusta antavan opettajan kelpoisuus",null,null,null,null,null,null,null,null,null,null,null,null,0.9731946328961254]
[22,null,"012448","4. Luokanopettaja b. Aineenopettajan kelpoisuus ja perus/lukio-opetusta antavan opettajan kelpoisuus",3176.22,3093.9,38,0.85699999999999998,0.88,0,null,6,7,8,null,6,1,1,1.06,1.1342000000000001,1.2249360000000002,1.2249360000000002,1.2984321600000004,0,"012448  4. Luokanopettaja b. Aineenopettajan kelpoisuus ja perus/lukio-opetusta antavan opettajan kelpoisuus",null,null,null,null,null,null,null,null,null,null,null,null,0.97408239983376477]
{"$rows_left_out":40}
{"sheet":"Amm. vuosityöaika","index":2,"n_rows":40,"n_cols":8,"rows_kept":40,"cut":false,"hidden":false,"merged":[[99,0,99,1]]}
[null,"Sivistan vuosityöaikasopimuksen palkkalaskuri"]
[null,"1.8.2025 lukien"]
[null,"Valitse hinnoittelukohta, kalleusluokka ja kokemuslisiin oikeuttava aika."]
[]
[]
[]
[null,null,"Hinnoittelukohdan alaraja:",null,null,{"$f":"AmmVTALask!D3","v":3530.63}]
[null,null,"Kokemuslisien prosentit"]
[null,null,"3 v","5 v","8 v","13 v","15 v","20 v"]
[null,null,{"$f":"AmmVTALask!F4","v":0.05},{"$f":"AmmVTALask!G4","v":0.04},{"$f":"AmmVTALask!H4","v":0.04},{"$f":"AmmVTALask!I4","v":0.05},{"$f":"AmmVTALask!J4","v":0.05},{"$f":"AmmVTALask!K4","v":0.05}]
[]
[null,null,null,null,null,"I kalleusluokan kunnat:"]
[null,null,null,null,null,"Enontekiö, Espoo, Helsinki, Hyrynsalmi, "]
[null,null,null,null,null,"Hyvinkää, Hämeenlinna, Ii, Inari, Joensuu, "]
[null,null,null,null,null,"Jyväskylä, Järvenpää, Kauniainen, Kemi, "]
[null,null,null,null,null,"Kemijärvi, Keminmaa, Kerava, Kirkkonummi,"]
[null,null,null,null,null,"Kittilä, Kolari, Kuhmo, Kuopio, Kuusamo,"]
[null,null,null,null,null,"Muonio, Oulu, Pelkosenniemi, Pello, Posio,"]
[null,null,null,null,null,"Ranua, Ristijärvi, Rovaniemi, Salla, Savukoski,"]
[null,null,null,null,null,"Simo, Sodankylä, Tampere, Tervola, Tornio,"]
[null,null,null,null,null,"Utsjoki, Vaasa, Vantaa ja Ylitornio."]
[]
[]
[]
[]
[]
[]
[]
[]
[null,null,"Vuosityöaika",null,null,null,null,1500]
{"$rows_left_out":11}
{"sheet":"Kansanopistot (vuosityöaika)","index":3,"n_rows":35,"n_cols":3,"rows_kept":35,"cut":false,"hidden":false,"merged":[]}
["VUOSITYÖAJASSA OLEVAT KANSANOPISTOT"]
[]
["Apulaisrehtorit (14 §)"]
["021159","Apulaisrehtorina/vararehtorina toimivan opettajan peruspalkka on","I ja II kalleusluokka "]
[null,"alkupalkka",3581.27]
[null,"3 vuoden jälkeen",3796.51]
[null,"5 vuoden jälkeen",3986.32]
[null,"7 vuoden jälkeen",4185.6499999999996]
[null,"10 vuoden jälkeen",4394.92]
[null,"15 vuoden jälkeen",4658.6099999999997]
[]
["Opettajat (17 §)"]
["022657","1) ylempi korkeakoulututkinto ja ylempi AMK-tutkinto","I ja II kalleusluokka "]
[null,"alkupalkka",3372.16]
[null,"3 vuoden jälkeen",3574.79]
[null,"5 vuoden jälkeen",3753.56]
[null,"7 vuoden jälkeen",3941.23]
[null,"10 vuoden jälkeen",4138.29]
[null,"15 vuoden jälkeen",4386.62]
[]
["022656","2) korkeakoulututkinto tai vastaava opettaja","I ja II kalleusluokka "]
[null,"alkupalkka",3295.03]
[null,"3 vuoden jälkeen",3493.06]
[null,"5 vuoden jälkeen",3667.72]
[null,"7 vuoden jälkeen",3851.13]
[null,"10 vuoden jälkeen",4043.67]
[null,"15 vuoden jälkeen",4286.29]
[]
["022653","3) muu tutkinto","I ja II kalleusluokka "]
[null,"alkupalkka",2866.76]
{"$rows_left_out":6}
{"sheet":"Urheiluopistot","index":4,"n_rows":48,"n_cols":8,"rows_kept":48,"cut":false,"hidden":false,"merged":[]}
["URHEILUOPISTOT"]
[]
[]
["1a. Opettaja (liikunta-aineet ja muut aineet) (7 §)"]
["032757/ 032857","a. Ylempi korkeakoulututkinto tai ylempi AMK-tutkinto","I kalleusluokka",null,null,"II kalleusluokka"]
[null,"alkupalkka",3762.97,"-",4132.97,3658.97,"-",4019.4]
[null,"3 vuoden jälkeen",3987.74,"-",4379.96,3877.5,"-",4259.58]
[null,"5 vuoden jälkeen",4185.97,"-",4597.8100000000004,4070.23,"-",4471.42]
[null,"8 vuoden jälkeen",4394.1400000000003,"-",4826.57,4272.6000000000004,"-",4693.8599999999997]
[null,"13 vuoden jälkeen",4656.41,"-",5114.82,4527.58,"-",4974.1000000000004]
[null,"20 vuoden jälkeen",4887.6400000000003,"-",5368.91,4752.3999999999996,"-",5221.21]
["032755/ 032855","b. Korkeakoulututkinto","I kalleusluokka",null,null,"II kalleusluokka"]
[null,"alkupalkka",3591.33,"-",3875.73,3493.3,"-",3769.52]
[null,"3 vuoden jälkeen",3805.78,"-",4107.26,3701.88,"-",3994.69]
[null,"5 vuoden jälkeen",3994.92,"-",4311.49,3885.83,"-",4193.28]
[null,"8 vuoden jälkeen",4193.5200000000004,"-",4525.92,4078.98,"-",4401.83]
[null,"13 vuoden jälkeen",4443.76,"-",4796.13,4322.3500000000004,"-",4664.55]
[null,"20 vuoden jälkeen",4664.38,"-",5034.33,4536.8999999999996,"-",4896.18]
["032751/ 032851","c. Muu tutkinto","I kalleusluokka",null,null,"II kalleusluokka"]
[null,"alkupalkka",3036.56,"-",3285.28,2953.48,"-",3195.73]
[null,"3 vuoden jälkeen",3217.67,"-",3481.34,3129.62,"-",3386.42]
[null,"5 vuoden jälkeen",3377.43,"-",3654.29,3284.92,"-",3554.6]
[null,"8 vuoden jälkeen",3545.14,"-",3835.86,3448.04,"-",3731.19]
[null,"13 vuoden jälkeen",3756.5,"-",4064.63,3653.58,"-",3953.68]
[null,"20 vuoden jälkeen",3942.8,"-",4266.34,3834.74,"-",4149.8599999999997]
[]
["1b. Opettaja (liikunta-aineet ja muut aineet) / Pajulahti ja Vierumäki"]
["032758/ 032858","a. Ylempi korkeakoulututkinto tai ylempi AMK-tutkinto","I kalleusluokka",null,null,"II kalleusluokka"]
[null,"alkupalkka",3875.73,"-",4198.8999999999996,3769.52,"-",4084.07]
[null,"3 vuoden jälkeen",4107.26,"-",4449.8599999999997,3994.69,"-",4328.1499999999996]
{"$rows_left_out":19}
{"sheet":"AmmVTALask","index":5,"n_rows":12,"n_cols":19,"rows_kept":12,"cut":false,"hidden":true,"merged":[]}
[null,null,"Rivinumero",null,1,0.83]
[null,null,"Kalleusluokka",null,2,{"$f":"1/F1","v":1.2048192771084338}]
[null,null,"Alaraja",{"$f":"VLOOKUP(E1,$A$9:$E$12,3+E2)","v":3530.63}]
[null,null,"TKP",3274.02,7,{"$f":"VLOOKUP($E$1,$A$9:$K$12,6)/100","v":0.05},{"$f":"VLOOKUP($E$1,$A$9:$K$12,7)/100","v":0.04},{"$f":"VLOOKUP($E$1,$A$9:$K$12,8)/100","v":0.04},{"$f":"VLOOKUP($E$1,$A$9:$K$12,9)/100","v":0.05},{"$f":"VLOOKUP($E$1,$A$9:$K$12,10)/100","v":0.05},{"$f":"VLOOKUP($E$1,$A$9:$K$12,11)/100","v":0.05}]
[null,null,"Tp",{"$f":"D4/125","v":26.192160000000001},{"$f":"VLOOKUP(E1,A9:R12,11+E4,FALSE)","v":1.3146915600000002}]
[null,null,"Vuosisi. lisä e",null,{"$f":"ROUND(E5*D3-D3,2)","v":1111.06}]
[]
["Index","Hitu","Nimi",null,null,"3v","5v","8v","13v","15v","20v","0 v.","5v","8v","10v","13v","15v","20v","Listanimi"]
[1,"068758 / 068858","Soveltuva ylempi korkeakoulututkinto tai ylempi AMK-tutkinto",3621.16,3530.63,5,4,4,5,5,5,1,{"$f":"F9/100+1","v":1.05},{"$f":"M9*(G9/100+1)","v":1.0920000000000001},{"$f":"N9*(H9/100+1)","v":1.13568},1.192464,1.2520872000000001,1.3146915600000002,{"$f":"B9&\" \"&C9","v":"068758 / 068858 Soveltuva ylempi korkeakoulututkinto tai ylempi AMK-tutkinto"}]
[2,"068756 / 068856","Soveltuva muu korkeakoulukoulututkinto, insinööri, rakennusarkkitehti",3286.62,3204.43,5,4,4,5,5,5,1,1.05,{"$f":"M10*(G10/100+1)","v":1.0920000000000001},1.13568,1.192464,1.2520872000000001,1.3146915600000002,{"$f":"B10&\" \"&C10","v":"068756 / 068856 Soveltuva muu korkeakoulukoulututkinto, insinööri, rakennusarkkitehti"}]
[3,"068754 / 068854","Soveltuva opistoasteen tutkinto",2979.28,2904.8,5,4,4,5,5,5,1,1.05,1.0920000000000001,1.13568,1.192464,1.2520872000000001,1.3146915600000002,{"$f":"B11&\" \"&C11","v":"068754 / 068854 Soveltuva opistoasteen tutkinto"}]
[4,"068752 / 068852","Soveltuva muu tutkinto tai koulutus",2638.86,2572.88,5,4,4,5,5,5,1,1.05,1.0920000000000001,1.13568,1.192464,1.2520872000000001,1.3146915600000002,{"$f":"B12&\" \"&C12","v":"068752 / 068852 Soveltuva muu tutkinto tai koulutus"}]